Target
Sodium channel protein type 4 subunit alpha
Ligand
BDBM50008746
Substrate
Meas. Tech.
ChEMBL_1336356 (CHEMBL3242064)
IC50
>100000±n/a nM
Citation
 Browne, LLidster, KAl-Izki, SClutterbuck, LPosada, CChan, AWRiddall, DGarthwaite, JBaker, DSelwood, DL Imidazol-1-ylethylindazole voltage-gated sodium channel ligands are neuroprotective during optic neuritis in a mouse model of multiple sclerosis. J Med Chem 57:2942-52 (2014)  
Target
Name:
Sodium channel protein type 4 subunit alpha
Synonyms:
SCN4A SkM1 Sodium channel protein skeletal muscle subunit alpha Sodium channel protein type IV alpha subunit Voltage-gated sodium channel subunit alpha Nav1.4 | Voltage-gated sodium channel subunit alpha Nav1.4 (Nav1.4)
Type:
Protein
Mol. Mass.:
208010.01
Organism:
Homo sapiens (Human)
Description:
P35499
Residue:
1836
  
Inhibitor
Name:
BDBM50008746
Synonyms:
CHEMBL3236343
Type:
Small organic molecule
Emp. Form.:
C22H19N7O2
Mol. Mass.:
413.432
SMILES:
O=C(NCc1noc(n1)-c1nn(CCn2ccnc2)c2ccccc12)c1ccccc1
: