Target
Sodium channel protein type 10 subunit alpha
Ligand
BDBM50008746
Substrate
Meas. Tech.
ChEMBL_1336378 (CHEMBL3242227)
IC50
28000±n/a nM
Citation
 Browne, LLidster, KAl-Izki, SClutterbuck, LPosada, CChan, AWRiddall, DGarthwaite, JBaker, DSelwood, DL Imidazol-1-ylethylindazole voltage-gated sodium channel ligands are neuroprotective during optic neuritis in a mouse model of multiple sclerosis. J Med Chem 57:2942-52 (2014)  
Target
Name:
Sodium channel protein type 10 subunit alpha
Synonyms:
PN3 SCN10A Sodium channel alpha subunit Sodium channel protein type X alpha subunit fret-membrane potential nav1.8 | hPN3
Type:
Enzyme
Mol. Mass.:
220609.21
Organism:
Homo sapiens (Human)
Description:
Q9Y5Y9
Residue:
1956
  
Inhibitor
Name:
BDBM50008746
Synonyms:
CHEMBL3236343
Type:
Small organic molecule
Emp. Form.:
C22H19N7O2
Mol. Mass.:
413.432
SMILES:
O=C(NCc1noc(n1)-c1nn(CCn2ccnc2)c2ccccc12)c1ccccc1
: