Target
Beta-glucuronidase
Ligand
BDBM50008904
Substrate
Meas. Tech.
ChEMBL_1337201 (CHEMBL3240405)
IC50
2800±n/a nM
Citation
 Khan, KMRahim, FWadood, ATaha, MKhan, MNaureen, SAmbreen, NHussain, SPerveen, SChoudhary, MI Evaluation of bisindole as potentß-glucuronidase inhibitors: synthesis and in silico based studies. Bioorg Med Chem Lett 24:1825-9 (2014)  
Target
Name:
Beta-glucuronidase
Synonyms:
Beta-glucuronidase EMBL:AAI33416.1 Ensembl:ENSBTAP00000000941} | GUSB
Type:
Protein
Mol. Mass.:
74467.69
Organism:
Bos taurus (Bovine)
Description:
EC 3.2.1.31, bovine liver
Residue:
652
  
Inhibitor
Name:
BDBM50008904
Synonyms:
CHEMBL3237336
Type:
Small organic molecule
Emp. Form.:
C26H18N4O2
Mol. Mass.:
418.4467
SMILES:
COc1cccc(C(c2c[nH]c3ccc(cc23)C#N)c2c[nH]c3ccc(cc23)C#N)c1O
: