Target
Glycogen phosphorylase, muscle form
Ligand
BDBM50009078
Substrate
Meas. Tech.
ChEMBL_1338433 (CHEMBL3240699)
Ki
2900±n/a nM
Citation
 Kun, SBokor, ÉVarga, GSzocs, BPáhi, ACzifrák, KTóth, MJuhász, LDocsa, TGergely, PSomsák, L New synthesis of 3-(ß-D-glucopyranosyl)-5-substituted-1,2,4-triazoles, nanomolar inhibitors of glycogen phosphorylase. Eur J Med Chem 76:567-79 (2014)  
Target
Name:
Glycogen phosphorylase, muscle form
Synonyms:
Glycogen Phosphorylase (PYGM) Glycogen phosphorylase, muscle form PYGM | PYGM_RABIT
Type:
Enzyme
Mol. Mass.:
97296.32
Organism:
Oryctolagus cuniculus (rabbit)
Description:
Phosphorylation of Ser-15 converts phosphorylase B (unphosphorylated) to phosphorylase A.
Residue:
843
  
Inhibitor
Name:
BDBM50009078
Synonyms:
CHEMBL3237969
Type:
Small organic molecule
Emp. Form.:
C14H17N3O6
Mol. Mass.:
323.3013
SMILES:
OC[C@H]1O[C@H]([C@H](O)[C@@H](O)[C@@H]1O)c1nc(n[nH]1)-c1ccc(O)cc1
: