Target
Glucokinase regulatory protein
Ligand
BDBM50009104
Substrate
Meas. Tech.
ChEMBL_1338436 (CHEMBL3240702)
EC50
388±n/a nM
Citation
 Nishimura, NNorman, MHLiu, LYang, KCAshton, KSBartberger, MDChmait, SChen, JCupples, RFotsch, CHelmering, JJordan, SRKunz, RKPennington, LDPoon, SFSiegmund, ASivits, GLloyd, DJHale, CSt Jean, DJ Small molecule disruptors of the glucokinase-glucokinase regulatory protein interaction: 3. Structure-activity relationships within the aryl carbinol region of the N-arylsulfonamido-N'-arylpiperazine series. J Med Chem 57:3094-116 (2014)  
Target
Name:
Glucokinase regulatory protein
Synonyms:
GCKR_MOUSE Glucokinase regulator
Type:
PROTEIN
Mol. Mass.:
64679.62
Organism:
Mus musculus
Description:
ChEMBL_108288
Residue:
587
  
Inhibitor
Name:
BDBM50009104
Synonyms:
CHEMBL3238303
Type:
Small organic molecule
Emp. Form.:
C19H20F3N5O3S2
Mol. Mass.:
487.519
SMILES:
CC#C[C@H]1CN(CCN1c1ccc(cc1)[S@](=N)(=O)C(F)(F)F)S(=O)(=O)c1ccc(N)nc1
: