Target
Neuraminidase
Ligand
BDBM50009296
Substrate
Meas. Tech.
ChEMBL_1335031 (CHEMBL3239462)
IC50
3100±n/a nM
Citation
 Abdel-Mageed, WMBayoumi, SAChen, CVavricka, CJLi, LMalik, ADai, HSong, FWang, LZhang, JGao, GFLv, YLiu, LLiu, XSayed, HMZhang, L Benzophenone C-glucosides and gallotannins from mango tree stem bark with broad-spectrum anti-viral activity. Bioorg Med Chem 22:2236-43 (2014)  
Target
Name:
Neuraminidase
Synonyms:
Type:
PROTEIN
Mol. Mass.:
52019.94
Organism:
Influenza A virus
Description:
ChEMBL_108266
Residue:
469
  
Inhibitor
Name:
BDBM50009296
Synonyms:
LANINAMIVIR | R-125489
Type:
Small organic molecule
Emp. Form.:
C13H22N4O7
Mol. Mass.:
346.3364
SMILES:
[H][C@]1(OC(=C[C@H](NC(N)=N)[C@H]1NC(C)=O)C(O)=O)[C@H](OC)[C@H](O)CO
: