Target
Prolyl endopeptidase FAP
Ligand
BDBM50009339
Substrate
Meas. Tech.
ChEMBL_1335495 (CHEMBL3239280)
IC50
290±n/a nM
Citation
 Jansen, KHeirbaut, LVerkerk, RCheng, JDJoossens, JCos, PMaes, LLambeir, AMDe Meester, IAugustyns, KVan der Veken, P Extended structure-activity relationship and pharmacokinetic investigation of (4-quinolinoyl)glycyl-2-cyanopyrrolidine inhibitors of fibroblast activation protein (FAP). J Med Chem 57:3053-74 (2014)  
Target
Name:
Prolyl endopeptidase FAP
Synonyms:
Fap SEPR_MOUSE | Seprase
Type:
Enzyme
Mol. Mass.:
87949.14
Organism:
Mus musculus (Mouse)
Description:
P97321
Residue:
761
  
Inhibitor
Name:
BDBM50009339
Synonyms:
CHEMBL3233558 | US9346814, Cmpd No 14 Example 18
Type:
Small organic molecule
Emp. Form.:
C19H18N4O2
Mol. Mass.:
334.3718
SMILES:
O=C(CNC(=O)c1ccnc(c1)-c1ccccc1)N1CCC[C@H]1C#N
: