Target
Chromobox protein homolog 8
Ligand
BDBM50009555
Substrate
Meas. Tech.
ChEMBL_1336413 (CHEMBL3242417)
Kd
1890±n/a nM
Citation
 Simhadri, CDaze, KDDouglas, SFQuon, TTDev, AGignac, MCPeng, FHeller, MBoulanger, MJWulff, JEHof, F Chromodomain antagonists that target the polycomb-group methyllysine reader protein chromobox homolog 7 (CBX7). J Med Chem 57:2874-83 (2014)  
Target
Name:
Chromobox protein homolog 8
Synonyms:
CBX8 PC3 RC1 hPc3
Type:
PROTEIN
Mol. Mass.:
43415.86
Organism:
Homo sapiens (Human)
Description:
ChEMBL_108272
Residue:
389
  
Inhibitor
Name:
BDBM50009555
Synonyms:
CHEMBL3234443
Type:
Small organic molecule
Emp. Form.:
C40H59N6O9
Mol. Mass.:
767.9307
SMILES:
COC(=O)c1ccc(cc1)C(=O)N[C@@H](Cc1ccccc1)C(=O)N[C@@H](C)C(=O)N[C@@H](C1CCCC1)C(=O)N[C@@H](CCCC[N+](C)(C)C)C(=O)NC(CO)CO
: