Target
Acrosin
Ligand
BDBM45440
Substrate
Meas. Tech.
ChEMBL_1344334 (CHEMBL3257004)
Ki
2300±n/a nM
Citation
 Parrish, RFStraus, JWPaulson, JDPolakoski, KLTidwell, RRGeratz, JDStevens, FM Structure-activity relationships for the inhibition of acrosin by benzamidine derivatives. J Med Chem 21:1132-6 (1979)  
Target
Name:
Acrosin
Synonyms:
53 kDa fucose-binding protein ACRO_PIG Acrosin light chain
Type:
PROTEIN
Mol. Mass.:
45383.66
Organism:
Sus scrofa
Description:
ChEMBL_108297
Residue:
415
  
Inhibitor
Name:
BDBM45440
Synonyms:
4-[5-(4-amidinophenoxy)pentoxy]benzamidine;2-hydroxyethanesulfonic acid 4-[5-(4-carbamimidoylphenoxy)pentoxy]benzenecarboximidamide;2-oxidanylethanesulfonic acid MLS000028738 PENTAMIDINE ISETHIONATE cid_359323
Type:
Small organic molecule
Emp. Form.:
C19H24N4O2
Mol. Mass.:
340.4195
SMILES:
NC(=N)c1ccc(OCCCCCOc2ccc(cc2)C(N)=N)cc1
: