Target
Aminopeptidase B
Ligand
BDBM50010140
Substrate
Meas. Tech.
ChEMBL_1344423 (CHEMBL3258373)
IC50
1400±n/a nM
Citation
 Nishizawa, RSaino, TTakita, TSuda, HAoyagi, T Synthesis and structure-activity relationships of bestatin analogues, inhibitors of aminopeptidase B. J Med Chem 20:510-5 (1977)  
Target
Name:
Aminopeptidase B
Synonyms:
AMPB_RAT Arginine aminopeptidase Cytosol aminopeptidase IV | Rnpep
Type:
PROTEIN
Mol. Mass.:
72609.93
Organism:
Rattus norvegicus
Description:
ChEMBL_1344423
Residue:
650
  
Inhibitor
Name:
BDBM50010140
Synonyms:
CHEMBL3251702
Type:
Small organic molecule
Emp. Form.:
C16H23ClN2O4
Mol. Mass.:
342.818
SMILES:
CC(C)C[C@H](NC(=O)C(O)C(N)Cc1ccccc1Cl)C(O)=O
: