Target
Aminopeptidase B
Ligand
BDBM50010222
Substrate
Meas. Tech.
ChEMBL_1344423 (CHEMBL3258373)
IC50
160±n/a nM
Citation
 Nishizawa, RSaino, TTakita, TSuda, HAoyagi, T Synthesis and structure-activity relationships of bestatin analogues, inhibitors of aminopeptidase B. J Med Chem 20:510-5 (1977)  
Target
Name:
Aminopeptidase B
Synonyms:
AMPB_RAT Arginine aminopeptidase Cytosol aminopeptidase IV | Rnpep
Type:
PROTEIN
Mol. Mass.:
72609.93
Organism:
Rattus norvegicus
Description:
ChEMBL_1344423
Residue:
650
  
Inhibitor
Name:
BDBM50010222
Synonyms:
CHEMBL3251673
Type:
Small organic molecule
Emp. Form.:
C16H24N2O4
Mol. Mass.:
308.3728
SMILES:
CC(C)C[C@@H](NC(=O)[C@@H](O)[C@@H](N)Cc1ccccc1)C(O)=O
: