Target
DNA gyrase subunit B
Ligand
BDBM50010368
Substrate
Meas. Tech.
ChEMBL_1353018 (CHEMBL3270626)
IC50
47±n/a nM
Citation
 Ahuja, VBasavarajappa, HP, SHBoriack-Sjodin, PAMcKinney, DGanguly, SKranthi, UGaonkar, SJena, LkGhorpade, SRGhosh, ABarde, SKale, MGKoushik, KKumar, CNManjunatha, MROgg, DPanduga, VRamya, VKReddy, JKumar, KNGiridhar, JRudrapatna, SSharma, STucker, JAVachaspati, PWaterson, Dde Sousa, SM Thiazolopyridine ureas as novel antitubercular agents acting through inhibition of DNA Gyrase B. Cell Chem Biol 56:8834-48 (2013)  
Target
Name:
DNA gyrase subunit B
Synonyms:
GYRB_MYCSM | gyrB
Type:
PROTEIN
Mol. Mass.:
74505.25
Organism:
Mycobacterium smegmatis
Description:
ChEMBL_107961
Residue:
675
  
Inhibitor
Name:
BDBM50010368
Synonyms:
CHEMBL3263610
Type:
Small organic molecule
Emp. Form.:
C20H21N7O2S
Mol. Mass.:
423.491
SMILES:
CCNC(=O)Nc1nc2cc(-c3ccc(nc3)C#N)c(NC3CCOCC3)nc2s1
: