Target
Histone-lysine N-methyltransferase EHMT1
Ligand
BDBM50010379
Substrate
Meas. Tech.
ChEMBL_1353169 (CHEMBL3266271)
IC50
235000±n/a nM
Citation
 Devkota, KLohse, BLiu, QWang, MWStærk, DBerthelsen, JClausen, RP Analogues of the Natural Product Sinefungin as Inhibitors of EHMT1 and EHMT2. ACS Med Chem Lett 5:293-7 (2014)  
Target
Name:
Histone-lysine N-methyltransferase EHMT1
Synonyms:
EHMT1 EUHMTASE1 Euchromatic histone-lysine N-methyltransferase 1 GLP H3-K9-HMTase 5 Histone-lysine N-methyltransferase EHMT1/EHMT2 KMT1D | Lysine N-methyltransferase 1D
Type:
PROTEIN
Mol. Mass.:
141443.67
Organism:
Homo sapiens (Human)
Description:
ChEMBL_1450367
Residue:
1298
  
Inhibitor
Name:
BDBM50010379
Synonyms:
CHEMBL3263625
Type:
Small organic molecule
Emp. Form.:
C18H21N5O3
Mol. Mass.:
355.391
SMILES:
Nc1ncnc2n(cnc12)[C@@H]1O[C@H](CCCc2ccccc2)[C@@H](O)[C@H]1O
: