Target
Histone-lysine N-methyltransferase EHMT2
Ligand
BDBM50010380
Substrate
Meas. Tech.
ChEMBL_1353170 (CHEMBL3266272)
IC50
1600±n/a nM
Citation
 Devkota, KLohse, BLiu, QWang, MWStærk, DBerthelsen, JClausen, RP Analogues of the Natural Product Sinefungin as Inhibitors of EHMT1 and EHMT2. ACS Med Chem Lett 5:293-7 (2014)  
Target
Name:
Histone-lysine N-methyltransferase EHMT2
Synonyms:
BAT8 EHMT2 G9A Histone-lysine N-methyltransferase EHMT1/EHMT2 KMT1C Protein G9a (G9a)
Type:
Enzyme
Mol. Mass.:
132339.87
Organism:
Homo sapiens (Human)
Description:
Q96KQ7
Residue:
1210
  
Inhibitor
Name:
BDBM50010380
Synonyms:
CHEMBL3263626
Type:
Small organic molecule
Emp. Form.:
C18H28N6O3
Mol. Mass.:
376.4533
SMILES:
NC(C[C@H]1O[C@H]([C@H](O)[C@@H]1O)n1cnc2c(N)ncnc12)CC1CCCCC1
: