Target
Histone-lysine N-methyltransferase EHMT2
Ligand
BDBM50010381
Substrate
Meas. Tech.
ChEMBL_1353170 (CHEMBL3266272)
IC50
157000±n/a nM
Citation
 Devkota, KLohse, BLiu, QWang, MWStærk, DBerthelsen, JClausen, RP Analogues of the Natural Product Sinefungin as Inhibitors of EHMT1 and EHMT2. ACS Med Chem Lett 5:293-7 (2014)  
Target
Name:
Histone-lysine N-methyltransferase EHMT2
Synonyms:
BAT8 EHMT2 G9A Histone-lysine N-methyltransferase EHMT1/EHMT2 KMT1C Protein G9a (G9a)
Type:
Enzyme
Mol. Mass.:
132339.87
Organism:
Homo sapiens (Human)
Description:
Q96KQ7
Residue:
1210
  
Inhibitor
Name:
BDBM50010381
Synonyms:
CHEMBL3263627
Type:
Small organic molecule
Emp. Form.:
C20H26N6O5
Mol. Mass.:
430.4576
SMILES:
COc1ccc(CC(N)C[C@H]2O[C@H]([C@H](O)[C@@H]2O)n2cnc3c(N)ncnc23)cc1OC
: