Target
Hepatocyte growth factor receptor
Ligand
BDBM50010418
Substrate
Meas. Tech.
ChEMBL_1353303 (CHEMBL3267805)
IC50
1.9±n/a nM
Citation
 Liu, ZAi, JPeng, XSong, ZWu, KZhang, JYao, QChen, YJi, YYang, YGeng, MZhang, A Novel 2,4-Diarylaminopyrimidine Analogues (DAAPalogues) Showing Potent c-Met/ALK Multikinase Inhibitory Activities. ACS Med Chem Lett 5:304-8 (2014)  
Target
Name:
Hepatocyte growth factor receptor
Synonyms:
Hepatocyte growth factor receptor Hepatocyte growth factor receptor (c-MET) MET Met proto-oncogene (hepatocyte growth factor receptor) Tyrosine-protein kinase Met (c-Met) c-Met kinase
Type:
Protein
Mol. Mass.:
155559.73
Organism:
Homo sapiens (Human)
Description:
P08581
Residue:
1390
  
Inhibitor
Name:
BDBM50010418
Synonyms:
CHEMBL3263982
Type:
Small organic molecule
Emp. Form.:
C25H27ClN6O2
Mol. Mass.:
478.974
SMILES:
CNC(=O)c1ccccc1Nc1nc(Nc2ccc3CCN(CC(C)c3c2)C(C)=O)ncc1Cl
: