Target
ALK tyrosine kinase receptor
Ligand
BDBM50010397
Substrate
Meas. Tech.
ChEMBL_1353304 (CHEMBL3267806)
IC50
19±n/a nM
Citation
 Liu, ZAi, JPeng, XSong, ZWu, KZhang, JYao, QChen, YJi, YYang, YGeng, MZhang, A Novel 2,4-Diarylaminopyrimidine Analogues (DAAPalogues) Showing Potent c-Met/ALK Multikinase Inhibitory Activities. ACS Med Chem Lett 5:304-8 (2014)  
Target
Name:
ALK tyrosine kinase receptor
Synonyms:
ALK ALK_HUMAN CD_antigen: CD246
Type:
Protein
Mol. Mass.:
176453.10
Organism:
Homo sapiens (Human)
Description:
Q9UM73
Residue:
1620
  
Inhibitor
Name:
BDBM50010397
Synonyms:
CHEMBL3263973
Type:
Small organic molecule
Emp. Form.:
C23H23ClN6O
Mol. Mass.:
434.921
SMILES:
CNC(=O)c1ccccc1Nc1nc(Nc2ccc3CCNCC(=C)c3c2)ncc1Cl
: