Target
Kappa-type opioid receptor
Ligand
BDBM50010651
Substrate
Meas. Tech.
ChEMBL_1353645 (CHEMBL3271434)
Ki
248±n/a nM
Citation
 Fujii, HHayashida, KSaitoh, AYokoyama, AHirayama, SIwai, TNakata, ENemoto, TSudo, YUezono, YYamada, MNagase, H Novel delta opioid receptor agonists with oxazatricyclodecane structure. ACS Med Chem Lett 5:368-72 (2014)  
Target
Name:
Kappa-type opioid receptor
Synonyms:
Kappa Opioid Receptor OPRK1 Opiate Kappa 1 | mu/kappa opioid receptor
Type:
G Protein-Coupled Receptor (GPCR)
Mol. Mass.:
42744.99
Organism:
Cavia porcellus (domestic guinea pig)
Description:
P41144
Residue:
380
  
Inhibitor
Name:
BDBM50010651
Synonyms:
CHEMBL3264741
Type:
Small organic molecule
Emp. Form.:
C30H34N2O5
Mol. Mass.:
502.6014
SMILES:
[H][C@@]12O[C@@]34CC[C@@](O)(N(Cc5ccccc5)C1=O)[C@]2([H])[C@@]31CCN(CC2CC2)[C@]4([H])Cc2ccc(OC)c(O)c12
: