Target
Free fatty acid receptor 1
Ligand
BDBM50010922
Substrate
Meas. Tech.
ChEMBL_1351094 (CHEMBL3270083)
EC50
6.0±n/a nM
Citation
 Du, XDransfield, PJLin, DCWong, SWang, YWang, ZKohn, TYu, MBrown, SPVimolratana, MZhu, LLi, ARSu, YJiao, XLiu, JJSwaminath, GTran, TLuo, JZhuang, RZhang, JGuo, QLi, FConnors, RMedina, JCHouze, JB Improving the Pharmacokinetics of GPR40/FFA1 Full Agonists. ACS Med Chem Lett 5:384-9 (2014)  
Target
Name:
Free fatty acid receptor 1
Synonyms:
FFAR1 G-protein Coupled Receptor 40 | GPR40
Type:
G Protein-Coupled Receptor (GPCR)
Mol. Mass.:
31473.32
Organism:
Homo sapiens (Human)
Description:
O14842
Residue:
300
  
Inhibitor
Name:
BDBM50010922
Synonyms:
CHEMBL3265145
Type:
Small organic molecule
Emp. Form.:
C30H35FN2O4
Mol. Mass.:
506.6083
SMILES:
CC[C@H](CC(O)=O)c1ccnc(OCc2ccc(c(c2)[C@@H]2CCCC2(C)C)-c2cc(OC)ncc2F)c1
: