Target
Proteasome subunit beta type-8
Ligand
BDBM50010994
Substrate
Meas. Tech.
ChEMBL_1351341 (CHEMBL3266190)
Ki
2000±n/a nM
Citation
 Fan, HAngelo, NGWarren, JDNathan, CFLin, G Oxathiazolones Selectively Inhibit the Human Immunoproteasome over the Constitutive Proteasome. ACS Med Chem Lett 5:405-10 (2014)  
Target
Name:
Proteasome subunit beta type-8
Synonyms:
26S proteosome Low molecular mass protein 7 Multicatalytic endopeptidase complex subunit C13 PSMB5i Proteasome component C13 Proteasome subunit beta-5i Y2
Type:
PROTEIN
Mol. Mass.:
30357.49
Organism:
Homo sapiens (Human)
Description:
ChEMBL_1446797
Residue:
276
  
Inhibitor
Name:
BDBM50010994
Synonyms:
CHEMBL3265178
Type:
Small organic molecule
Emp. Form.:
C7H4N2O2S
Mol. Mass.:
180.184
SMILES:
O=c1oc(ns1)-c1ccccn1
: