Target
Coagulation factor XI
Ligand
BDBM50011242
Substrate
Meas. Tech.
ChEMBL_1351824 (CHEMBL3271330)
Ki
0.080000±n/a nM
Citation
 Abdel-Magid, AF Inhibitors of Factor XIa and Plasma Kallikrein May Treat Thromboembolic Disorders and Many Diabetes Complications. ACS Med Chem Lett 5:286-7 (2014)  
Target
Name:
Coagulation factor XI
Synonyms:
Coagulation factor XIa Coagulation factor XIa light chain FA11_HUMAN Factor XIa PTA | Plasma thromboplastin antecedent
Type:
Enzyme
Mol. Mass.:
70130.58
Organism:
Homo sapiens (Human)
Description:
P03951
Residue:
625
  
Inhibitor
Name:
BDBM50011242
Synonyms:
CHEMBL3260339
Type:
Small organic molecule
Emp. Form.:
C31H29BrClFN4O4
Mol. Mass.:
655.942
SMILES:
COC(=O)Nc1ccc-2c(NC(=O)[C@H](C)CCC[C@H](N3CCC(=CC3=O)c3c(Br)ccc(Cl)c3F)c3cc-2ccn3)c1
: