Target
Plasma kallikrein
Ligand
BDBM50011242
Substrate
Meas. Tech.
ChEMBL_1351825 (CHEMBL3271331)
Ki
3.0±n/a nM
Citation
 Abdel-Magid, AF Inhibitors of Factor XIa and Plasma Kallikrein May Treat Thromboembolic Disorders and Many Diabetes Complications. ACS Med Chem Lett 5:286-7 (2014)  
Target
Name:
Plasma kallikrein
Synonyms:
Fletcher factor KLKB1 Kallikrein Plasma kallikrein heavy chain Plasma prekallikrein
Type:
Protein
Mol. Mass.:
71391.16
Organism:
Homo sapiens (Human)
Description:
P03952
Residue:
638
  
Inhibitor
Name:
BDBM50011242
Synonyms:
CHEMBL3260339
Type:
Small organic molecule
Emp. Form.:
C31H29BrClFN4O4
Mol. Mass.:
655.942
SMILES:
COC(=O)Nc1ccc-2c(NC(=O)[C@H](C)CCC[C@H](N3CCC(=CC3=O)c3c(Br)ccc(Cl)c3F)c3cc-2ccn3)c1
: