Target
Nicotinamide phosphoribosyltransferase
Ligand
BDBM50438936
Substrate
Meas. Tech.
ChEMBL_1351849 (CHEMBL3271355)
IC50
24±n/a nM
Citation
 Zheng, XBair, KWBauer, PBaumeister, TBowman, KKBuckmelter, AJCaligiuri, MClodfelter, KHFeng, YHan, BHo, YCKley, NLi, HLiang, XLiederer, BMLin, JLy, JO'Brien, TOeh, JOh, AReynolds, DJSampath, DSharma, GSkelton, NSmith, CCTremayne, JWang, LWang, WWang, ZWu, HWu, JXiao, YYang, GYuen, PWZak, MDragovich, PS Identification of amides derived from 1H-pyrazolo[3,4-b]pyridine-5-carboxylic acid as potent inhibitors of human nicotinamide phosphoribosyltransferase (NAMPT). Bioorg Med Chem Lett 23:5488-97 (2013)  
Target
Name:
Nicotinamide phosphoribosyltransferase
Synonyms:
NAMPT_MOUSE Nampt | Pbef1
Type:
PROTEIN
Mol. Mass.:
55450.71
Organism:
Mus musculus
Description:
ChEMBL_108315
Residue:
491
  
Inhibitor
Name:
BDBM50438936
Synonyms:
CHEMBL2420629 | GNE-617
Type:
Small organic molecule
Emp. Form.:
C21H15F2N3O3S
Mol. Mass.:
427.424
SMILES:
Fc1cc(F)cc(c1)S(=O)(=O)c1ccc(CNC(=O)c2ccc3nccn3c2)cc1
: