Target
Nicotinamide phosphoribosyltransferase
Ligand
BDBM50438936
Substrate
Meas. Tech.
ChEMBL_1351856 (CHEMBL3271362)
EC50
1.1±n/a nM
Citation
 Zheng, XBair, KWBauer, PBaumeister, TBowman, KKBuckmelter, AJCaligiuri, MClodfelter, KHFeng, YHan, BHo, YCKley, NLi, HLiang, XLiederer, BMLin, JLy, JO'Brien, TOeh, JOh, AReynolds, DJSampath, DSharma, GSkelton, NSmith, CCTremayne, JWang, LWang, WWang, ZWu, HWu, JXiao, YYang, GYuen, PWZak, MDragovich, PS Identification of amides derived from 1H-pyrazolo[3,4-b]pyridine-5-carboxylic acid as potent inhibitors of human nicotinamide phosphoribosyltransferase (NAMPT). Bioorg Med Chem Lett 23:5488-97 (2013)  
Target
Name:
Nicotinamide phosphoribosyltransferase
Synonyms:
NAMPT NAmPRTase Nicotinamide phosphoribosyltransferase (NAMPT) PBEF1 | Pre-B-cell colony-enhancing factor 1
Type:
Enzyme
Mol. Mass.:
55524.98
Organism:
Homo sapiens (Human)
Description:
P43490
Residue:
491
  
Inhibitor
Name:
BDBM50438936
Synonyms:
CHEMBL2420629 | GNE-617
Type:
Small organic molecule
Emp. Form.:
C21H15F2N3O3S
Mol. Mass.:
427.424
SMILES:
Fc1cc(F)cc(c1)S(=O)(=O)c1ccc(CNC(=O)c2ccc3nccn3c2)cc1
: