Target
Adenosine receptor A2a
Ligand
BDBM50011298
Substrate
Meas. Tech.
ChEMBL_1352083 (CHEMBL3267348)
Ki
3.0±n/a nM
Citation
 de Lera Ruiz, MLim, YHZheng, J Adenosine A2A receptor as a drug discovery target. J Med Chem 57:3623-50 (2014)  
Target
Name:
Adenosine receptor A2a
Synonyms:
A2A adenosine receptor (hA2A) ADENOSINE A2 ADORA2 Adenosine A2A receptor (A2AAR)
Type:
G Protein-Coupled Receptor (GPCR)
Mol. Mass.:
44716.46
Organism:
Homo sapiens (Human)
Description:
P29274
Residue:
412
  
Inhibitor
Name:
BDBM50011298
Synonyms:
CHEMBL3260730 | US9029393, 101
Type:
Small organic molecule
Emp. Form.:
C23H22N6O2
Mol. Mass.:
414.4598
SMILES:
COC[C@H]1CCCN1C(=O)c1ccc2c(nn(C)c2c1)-c1cnc2ccc(cn12)C#N
: