Target
Adenosine receptor A2a
Ligand
BDBM50152240
Substrate
Meas. Tech.
ChEMBL_1352091 (CHEMBL3267356)
Ki
4.0±n/a nM
Citation
 de Lera Ruiz, MLim, YHZheng, J Adenosine A2A receptor as a drug discovery target. J Med Chem 57:3623-50 (2014)  
Target
Name:
Adenosine receptor A2a
Synonyms:
AA2AR_RAT Adenosine A2 receptor Adenosine Receptors A2a (A2a) Adenosine receptors A2a Rat striatal adenosine A2a receptor
Type:
G Protein-Coupled Receptor (GPCR)
Mol. Mass.:
45015.65
Organism:
Rattus norvegicus (rat)
Description:
Rat A2A receptors expressed in CHO cells.
Residue:
410
  
Inhibitor
Name:
BDBM50152240
Synonyms:
CHEMBL184309 | N*5*-{2-[4-(2,4-Difluoro-phenyl)-piperazin-1-yl]-ethyl}-2-furan-2-yl-N*5*-methyl-[1,2,4]triazolo[1,5-a][1,3,5]triazine-5,7-diamine
Type:
Small organic molecule
Emp. Form.:
C21H23F2N9O
Mol. Mass.:
455.4638
SMILES:
CN(CCN1CCN(CC1)c1ccc(F)cc1F)c1nc(N)n2nc(nc2n1)-c1ccco1
: