Target
Melatonin receptor type 1B
Ligand
BDBM50125754
Substrate
Meas. Tech.
ChEMBL_1352335 (CHEMBL3269752)
Ki
149±n/a nM
Citation
 Zlotos, DPJockers, RCecon, ERivara, SWitt-Enderby, PA MT1 and MT2 melatonin receptors: ligands, models, oligomers, and therapeutic potential. J Med Chem 57:3161-85 (2014)  
Target
Name:
Melatonin receptor type 1B
Synonyms:
MTNR1B Mel-1B-R Melatonin 1B Melatonin receptor type 1B | Melatonin receptor type 2 (MT2)
Type:
Enzyme
Mol. Mass.:
40203.54
Organism:
Homo sapiens (Human)
Description:
P49286
Residue:
362
  
Inhibitor
Name:
BDBM50125754
Synonyms:
CHEMBL429392 N-[2-(7-{3-[8-(2-Acetylamino-ethyl)-naphthalen-2-yloxy]-propoxy}-naphthalen-1-yl)-ethyl]-acetamide
Type:
Small organic molecule
Emp. Form.:
C31H34N2O4
Mol. Mass.:
498.6127
SMILES:
CC(=O)NCCc1cccc2ccc(OCCCOc3ccc4cccc(CCNC(C)=O)c4c3)cc12
: