Target
Melatonin receptor type 1B
Ligand
BDBM50114716
Substrate
Meas. Tech.
ChEMBL_1352262 (CHEMBL3268980)
Ki
0.050000±n/a nM
Citation
 Zlotos, DPJockers, RCecon, ERivara, SWitt-Enderby, PA MT1 and MT2 melatonin receptors: ligands, models, oligomers, and therapeutic potential. J Med Chem 57:3161-85 (2014)  
Target
Name:
Melatonin receptor type 1B
Synonyms:
MTNR1B Mel-1B-R Melatonin 1B Melatonin receptor type 1B | Melatonin receptor type 2 (MT2)
Type:
Enzyme
Mol. Mass.:
40203.54
Organism:
Homo sapiens (Human)
Description:
P49286
Residue:
362
  
Inhibitor
Name:
BDBM50114716
Synonyms:
CHEMBL329263 | N-[2-(2-Benzyl-5-methoxy-benzofuran-3-yl)-ethyl]-acetamide
Type:
Small organic molecule
Emp. Form.:
C20H21NO3
Mol. Mass.:
323.3856
SMILES:
COc1ccc2oc(Cc3ccccc3)c(CCNC(C)=O)c2c1
: