Target
Nociceptin receptor
Ligand
BDBM50011515
Substrate
Meas. Tech.
ChEMBL_1351168 (CHEMBL3270911)
Ki
3.0±n/a nM
Citation
 Journigan, VBPolgar, WEKhroyan, TVZaveri, NT Designing bifunctional NOP receptor-mu opioid receptor ligands from NOP-receptor selective scaffolds. Part II. Bioorg Med Chem 22:2508-16 (2014)  
Target
Name:
Nociceptin receptor
Synonyms:
KOR-3 Mu-type opioid receptor (Mu) Nociceptin Receptor (ORL1 Receptor) Nociceptin receptor (ORL-1) Nociceptin/Orphanin FQ, NOP receptor OPIATE ORL-1 OPRL1 protein ORL1 Opioid receptor like-1 Orphanin FQ receptor (ORL1) | P41146
Type:
G Protein-Coupled Receptor (GPCR)
Mol. Mass.:
40702.87
Organism:
Homo sapiens (Human)
Description:
P41146
Residue:
370
  
Inhibitor
Name:
BDBM50011515
Synonyms:
CHEMBL3262545
Type:
Small organic molecule
Emp. Form.:
C28H34N2O
Mol. Mass.:
414.5824
SMILES:
[H][C@]12CCCc3cccc([C@@H](CC1)N1CCC(CC1)N1C(=O)C(CC)c4ccccc14)c23
: