Target
Mitogen-activated protein kinase kinase kinase kinase 4
Ligand
BDBM50011558
Substrate
Meas. Tech.
ChEMBL_1351267 (CHEMBL3265752)
IC50
387±n/a nM
Citation
 Crawford, TDNdubaku, COChen, HBoggs, JWBravo, BJDelatorre, KGiannetti, AMGould, SEHarris, SFMagnuson, SRMcNamara, EMurray, LJNonomiya, JSambrone, ASchmidt, SSmyczek, TStanley, MVitorino, PWang, LWest, KWu, PYe, W Discovery of selective 4-Amino-pyridopyrimidine inhibitors of MAP4K4 using fragment-based lead identification and optimization. J Med Chem 57:3484-93 (2014)  
Target
Name:
Mitogen-activated protein kinase kinase kinase kinase 4
Synonyms:
HGK KIAA0687 MAP4K4 MAPK/ERK kinase kinase kinase 4 MEKKK 4 NIK | Nck-interacting kinase
Type:
Serine/threonine-protein kinase
Mol. Mass.:
142114.73
Organism:
Homo sapiens (Human)
Description:
O95819
Residue:
1239
  
Inhibitor
Name:
BDBM50011558
Synonyms:
CHEMBL3262577 US9855269, Compound 113
Type:
Small organic molecule
Emp. Form.:
C14H11FN4
Mol. Mass.:
254.2623
SMILES:
Nc1cc(ccc1F)-c1ccc2ncnc(N)c2c1
: