Target
Protein kinase C delta type
Ligand
BDBM50011808
Substrate
Meas. Tech.
ChEMBL_1351519 (CHEMBL3268114)
Kd
777±n/a nM
Citation
 Pu, YKang, JHSigano, DMPeach, MLLewin, NEMarquez, VEBlumberg, PM Diacylglycerol lactones targeting the structural features that distinguish the atypical C1 domains of protein kinase C¿ and¿ from typical C1 domains. J Med Chem 57:3835-44 (2014)  
Target
Name:
Protein kinase C delta type
Synonyms:
KPCD_MOUSE Prkcd Protein kinase C delta type | nPKC-delta
Type:
PROTEIN
Mol. Mass.:
77554.99
Organism:
Mus musculus
Description:
ChEMBL_1351519
Residue:
674
  
Inhibitor
Name:
BDBM50011808
Synonyms:
CHEMBL3262943
Type:
Small organic molecule
Emp. Form.:
C22H38O7
Mol. Mass.:
414.5329
SMILES:
CC(C)CC(C\C=C1/CC(CO)(COC(=O)C(C)(CO)CO)OC1=O)CC(C)C
: