Target
Monoglyceride lipase
Ligand
BDBM50012157
Substrate
Meas. Tech.
ChEMBL_1352950 (CHEMBL3269817)
IC50
>100000±n/a nM
Citation
 Duncan, KKOtrubova, KBoger, DL a-Ketoheterocycle inhibitors of fatty acid amide hydrolase: exploration of conformational constraints in the acyl side chain. Bioorg Med Chem 22:2763-70 (2014)  
Target
Name:
Monoglyceride lipase
Synonyms:
MAG lipase Mgll Monoglyceride Lipase (MGL)
Type:
Hydrolase
Mol. Mass.:
33391.67
Organism:
Mus musculus (mouse)
Description:
Assays were using membranes of recombinant MAG Lipase transiently transfected in COS-7 cells.
Residue:
303
  
Inhibitor
Name:
BDBM50012157
Synonyms:
CHEMBL3264462
Type:
Small organic molecule
Emp. Form.:
C24H18N2O4
Mol. Mass.:
398.4107
SMILES:
O=C(C1CCc2cc(Oc3ccccc3)ccc2O1)c1ncc(o1)-c1ccccn1
: