Target
Beta-secretase 1
Ligand
BDBM50012649
Substrate
Meas. Tech.
ChEMBL_1351652 (CHEMBL3269339)
IC50
240±n/a nM
Citation
 Oehlrich, DProkopcova, HGijsen, HJ The evolution of amidine-based brain penetrant BACE1 inhibitors. Bioorg Med Chem Lett 24:2033-45 (2014)  
Target
Name:
Beta-secretase 1
Synonyms:
ASP2 Aspartyl protease 2 BACE1 Beta-secretase (BACE) Beta-secretase 1 (BACE 1) Beta-secretase 1 (BACE1) Beta-site amyloid precursor protein cleaving enzyme 1 Memapsin-2 beta-Secretase (BACE-1) | beta-Secretase (BACE1)
Type:
Protein
Mol. Mass.:
55755.10
Organism:
Homo sapiens (Human)
Description:
P56817
Residue:
501
  
Inhibitor
Name:
BDBM50012649
Synonyms:
CHEMBL3261063
Type:
Small organic molecule
Emp. Form.:
C17H17ClN4O2
Mol. Mass.:
344.795
SMILES:
CC1(COCC(N)=N1)c1cccc(NC(=O)c2ccc(Cl)cn2)c1
: