Target
Macrophage migration inhibitory factor
Ligand
BDBM50013041
Substrate
Meas. Tech.
ChEMBL_1351719 (CHEMBL3270119)
Ki
5141±n/a nM
Citation
 Xu, LZhang, YZheng, LQiao, CLi, YLi, DZhen, XHou, T Discovery of novel inhibitors targeting the macrophage migration inhibitory factor via structure-based virtual screening and bioassays. J Med Chem 57:3737-45 (2014)  
Target
Name:
Macrophage migration inhibitory factor
Synonyms:
GIF Glycosylation-inhibiting factor L-dopachrome tautomerase MIF/CD74 (Macrophage migration inhibitory factor and HLA-DR antigens-associated invariant chain) MMIF Macrophage migration inhibitory factor (MIF) | Phenylpyruvate tautomerase
Type:
Enzyme
Mol. Mass.:
12478.18
Organism:
Homo sapiens (Human)
Description:
P14174
Residue:
115
  
Inhibitor
Name:
BDBM50013041
Synonyms:
CHEMBL3261385
Type:
Small organic molecule
Emp. Form.:
C18H14N2O5S
Mol. Mass.:
370.379
SMILES:
COc1ccc(cc1NC(=S)NC(=O)c1cc2ccccc2o1)C(O)=O
: