Target
5-hydroxytryptamine receptor 2C
Ligand
BDBM50013069
Substrate
Meas. Tech.
ChEMBL_1350021 (CHEMBL3270821)
Ki
16±n/a nM
Citation
 Eliás, OAgai-Csongor, EDomány, GKeseru, GMGere, AKiss, BHellinger, EVastag, MGyertyán, I Design of novel multiple-acting ligands towards SERT and 5-HT2C receptors. Bioorg Med Chem Lett 24:2118-22 (2014)  
Target
Name:
5-hydroxytryptamine receptor 2C
Synonyms:
5-HT2C 5-hydroxytryptamine receptor 2C (5HT2c) 5ht1c Htr2c Serotonin receptor 2a and 2c (5HT2A and 5HT2C)
Type:
Enzyme
Mol. Mass.:
51935.10
Organism:
Rattus norvegicus (Rat)
Description:
P08909
Residue:
460
  
Inhibitor
Name:
BDBM50013069
Synonyms:
CHEMBL3261686
Type:
Small organic molecule
Emp. Form.:
C27H30N4O2
Mol. Mass.:
442.5527
SMILES:
CN(C)CCC(Oc1ccc(NC(=O)Nc2ccc3n(C)ccc3c2)cc1)c1ccccc1
: