Target
Sodium-dependent serotonin transporter
Ligand
BDBM82272
Substrate
Meas. Tech.
ChEMBL_1350019 (CHEMBL3270819)
Ki
>10000±n/a nM
Citation
 Eliás, OAgai-Csongor, EDomány, GKeseru, GMGere, AKiss, BHellinger, EVastag, MGyertyán, I Design of novel multiple-acting ligands towards SERT and 5-HT2C receptors. Bioorg Med Chem Lett 24:2118-22 (2014)  
Target
Name:
Sodium-dependent serotonin transporter
Synonyms:
5-HT Transporter 5HT transporter Anandamid membrane transporter, AMT Monoamine transporters; Norepinephrine & serotonin Slc6a4 Sodium-dependent serotonin transporter (SERT) | imipramine receptor
Type:
Multi-pass membrane protein
Mol. Mass.:
70168.43
Organism:
Rattus norvegicus (rat)
Description:
P31652
Residue:
630
  
Inhibitor
Name:
BDBM82272
Synonyms:
SB 200646 | SB200646a
Type:
Emp. Form.:
C15H14N4O
Mol. Mass.:
266.2979
SMILES:
Cn1ccc2cc(NC(=O)Nc3cccnc3)ccc12
: