Target
Acetylcholinesterase
Ligand
BDBM50011780
Substrate
Meas. Tech.
ChEMBL_1350415 (CHEMBL3268869)
Kd
25720±n/a nM
Citation
 Karade, HNValiveti, AKAcharya, JKaushik, MP Synthesis and in vitro evaluation of bis-quaternary 2-(hydroxyimino)-N-(pyridin-3-yl)acetamide derivatives as reactivators against sarin and VX inhibited human acetylcholinesterase (hAChE). Bioorg Med Chem 22:2684-91 (2014)  
Target
Name:
Acetylcholinesterase
Synonyms:
ACES_HUMAN Acetylcholinesterase (AChE) | Acetylcholinesterase (human AChE)
Type:
Enzyme
Mol. Mass.:
67792.70
Organism:
Homo sapiens (Human)
Description:
P22303
Residue:
614
  
Inhibitor
Name:
BDBM50011780
Synonyms:
2-[(E)-(hydroxyimino)methyl]-1-methylpyridinium chloride PRALIDOXIME Pralidoxine chloride
Type:
Small organic molecule
Emp. Form.:
C7H9N2O
Mol. Mass.:
137.1586
SMILES:
C[n+]1ccccc1CN=O
: