Target
Acetylcholinesterase
Ligand
BDBM50013130
Substrate
Meas. Tech.
ChEMBL_1350416 (CHEMBL3268870)
Kd
88860±n/a nM
Citation
 Karade, HNValiveti, AKAcharya, JKaushik, MP Synthesis and in vitro evaluation of bis-quaternary 2-(hydroxyimino)-N-(pyridin-3-yl)acetamide derivatives as reactivators against sarin and VX inhibited human acetylcholinesterase (hAChE). Bioorg Med Chem 22:2684-91 (2014)  
Target
Name:
Acetylcholinesterase
Synonyms:
ACES_HUMAN Acetylcholinesterase (AChE) | Acetylcholinesterase (human AChE)
Type:
Enzyme
Mol. Mass.:
67792.70
Organism:
Homo sapiens (Human)
Description:
P22303
Residue:
614
  
Inhibitor
Name:
BDBM50013130
Synonyms:
CHEMBL3261985
Type:
Small organic molecule
Emp. Form.:
C17H20Br2N6O4
Mol. Mass.:
532.187
SMILES:
[Br-].[Br-].O\N=C/C(=O)Nc1ccc[n+](CCC[n+]2cccc(NC(=O)\C=N/O)c2)c1
: