Target
Vitamin D3 receptor
Ligand
BDBM50013617
Substrate
Meas. Tech.
ChEMBL_1349194 (CHEMBL3267968)
IC50
2.4±n/a nM
Citation
 Anami, YItoh, TEgawa, DYoshimoto, NYamamoto, K A mixed population of antagonist and agonist binding conformers in a single crystal explains partial agonism against vitamin D receptor: active vitamin D analogues with 22R-alkyl group. J Med Chem 57:4351-67 (2014)  
Target
Name:
Vitamin D3 receptor
Synonyms:
1,25-dihydroxyvitamin D3 receptor Nuclear receptor subfamily 1 group I member 1 VDR | VDR_HUMAN
Type:
Protein
Mol. Mass.:
48288.72
Organism:
Homo sapiens (Human)
Description:
P11473
Residue:
427
  
Inhibitor
Name:
BDBM50013617
Synonyms:
CHEMBL3264167
Type:
Small organic molecule
Emp. Form.:
C29H48O3
Mol. Mass.:
444.6896
SMILES:
[H][C@@]1([#6]-[#6][C@@]2([H])\[#6](-[#6]-[#6]-[#6][C@]12[#6])=[#6]\[#6]=[#6]-1/[#6]-[#6@@H](-[#8])-[#6](=[#6])-[#6@H](-[#8])-[#6]-1)[#6@H](-[#6])-[#6@H](-[#6]-[#6])-[#6]-[#6]C([#6])([#6])[#8]
: