Target
Botulinum neurotoxin type A
Ligand
BDBM23274
Substrate
Meas. Tech.
ChEMBL_1349201 (CHEMBL3267975)
IC50
670±n/a nM
Citation
 Videnovic, MOpsenica, DMBurnett, JCGomba, LNuss, JESelakovic, ZKonstantinovic, JKrstic, MSegan, SZlatovic, MSciotti, RJBavari, SSolaja, BA Second generation steroidal 4-aminoquinolines are potent, dual-target inhibitors of the botulinum neurotoxin serotype A metalloprotease and P. falciparum malaria. J Med Chem 57:4134-53 (2014)  
Target
Name:
Botulinum neurotoxin type A
Synonyms:
BXA1_CLOBO bonT | botA
Type:
PROTEIN
Mol. Mass.:
149450.01
Organism:
Clostridium botulinum
Description:
ChEMBL_1510137
Residue:
1296
  
Inhibitor
Name:
BDBM23274
Synonyms:
(2E)-3-(2,4-dichlorophenyl)-N-hydroxyprop-2-enamide BMCL176463 Compound 2 | Cinnamic hydroxamate deriv., 18
Type:
Small organic molecule
Emp. Form.:
C9H7Cl2NO2
Mol. Mass.:
232.063
SMILES:
ONC(=O)\C=C\c1ccc(Cl)cc1Cl
: