Target
Histamine H3 receptor
Ligand
BDBM50375373
Substrate
Meas. Tech.
ChEMBL_1349364 (CHEMBL3269587)
Ki
0.741310±n/a nM
Citation
 Wingen, KSchwed, JSIsensee, KWeizel, LZivkovic, AOdadzic, DOdazic, DStark, H Benzylpiperidine variations on histamine H3 receptor ligands for improved drug-likeness. Bioorg Med Chem Lett 24:2236-9 (2014)  
Target
Name:
Histamine H3 receptor
Synonyms:
G-protein coupled receptor 97 HH3R HRH3 Histamine H3 receptor (H3) Histamine receptor (H3 and H4)
Type:
G Protein-Coupled Receptor (GPCR)
Mol. Mass.:
48691.47
Organism:
Homo sapiens (Human)
Description:
Binding assays were using CHO cells stably expressing hH3R receptors.
Residue:
445
  
Inhibitor
Name:
BDBM50375373
Synonyms:
CHEMBL129306
Type:
Small organic molecule
Emp. Form.:
C20H32N2O2
Mol. Mass.:
332.4803
SMILES:
OC1CCN(Cc2ccc(OCCCN3CCCCC3)cc2)CC1
: