Target
Carbonic anhydrase 1
Ligand
BDBM50013758
Substrate
Meas. Tech.
ChEMBL_1349401 (CHEMBL3269991)
Ki
30±n/a nM
Citation
 Nasr, GCristian, ABarboiu, MVullo, DWinum, JYSupuran, CT Carbonic anhydrase inhibitors. Inhibition of human cytosolic isoforms I and II with (reduced) Schiff's bases incorporating sulfonamide, carboxylate and carboxymethyl moieties. Bioorg Med Chem 22:2867-74 (2014)  
Target
Name:
Carbonic anhydrase 1
Synonyms:
CA-I CAB Carbonate dehydratase I Carbonic anhydrase 1 (CA I) Carbonic anhydrase 1 (Recombinant CA I) Carbonic anhydrase B Carbonic anhydrase I (CA I) Carbonic anhydrase I (CAI) Carbonic anhydrase isoenzyme I (hCA I) | hCA
Type:
Enzyme
Mol. Mass.:
28873.37
Organism:
Homo sapiens (Human)
Description:
P00915
Residue:
261
  
Inhibitor
Name:
BDBM50013758
Synonyms:
CHEMBL3264972
Type:
Small organic molecule
Emp. Form.:
C14H17ClN2O2S
Mol. Mass.:
312.815
SMILES:
Cl.NS(=O)(=O)c1ccc(CNCc2ccccc2)cc1
: