Target
Apoptosis regulator Bcl-2
Ligand
BDBM53290
Substrate
Meas. Tech.
ChEMBL_1349704 (CHEMBL3266888)
Ki
23830±n/a nM
Citation
 Abulwerdi, FALiao, CMady, ASGavin, JShen, CCierpicki, TStuckey, JAShowalter, HDNikolovska-Coleska, Z 3-Substituted-N-(4-hydroxynaphthalen-1-yl)arylsulfonamides as a novel class of selective Mcl-1 inhibitors: structure-based design, synthesis, SAR, and biological evaluation. J Med Chem 57:4111-33 (2014)  
Target
Name:
Apoptosis regulator Bcl-2
Synonyms:
Apoptosis regulator Bcl-2 Protein BCL-2 BCL2_HUMAN | Bcl-2 Protein
Type:
Homodimer or heterodimer
Mol. Mass.:
26269.11
Organism:
Homo sapiens (Human)
Description:
P10415
Residue:
239
  
Inhibitor
Name:
BDBM53290
Synonyms:
2-[4-[(4-bromophenyl)sulfonylamino]-1-hydroxynaphthalen-2-yl]sulfanylacetic acid 2-[[4-(brosylamino)-1-hydroxy-2-naphthyl]thio]acetic acid MLS001196198 [(4-{[(4-bromophenyl)sulfonyl]amino}-1-hydroxy-2-naphthyl)thio]acetic acid | cid_992586
Type:
Small organic molecule
Emp. Form.:
C18H14BrNO5S2
Mol. Mass.:
468.341
SMILES:
OC(=O)CSc1cc(NS(=O)(=O)c2ccc(Br)cc2)c2ccccc2c1O
: