Target
Bcl-2-like protein 2
Ligand
BDBM50013839
Substrate
Meas. Tech.
ChEMBL_1349705 (CHEMBL3266889)
Ki
37530±n/a nM
Citation
 Abulwerdi, FALiao, CMady, ASGavin, JShen, CCierpicki, TStuckey, JAShowalter, HDNikolovska-Coleska, Z 3-Substituted-N-(4-hydroxynaphthalen-1-yl)arylsulfonamides as a novel class of selective Mcl-1 inhibitors: structure-based design, synthesis, SAR, and biological evaluation. J Med Chem 57:4111-33 (2014)  
Target
Name:
Bcl-2-like protein 2
Synonyms:
Apoptosis regulator Bcl-W BCL-W BCLW Bcl2-L-2 | KIAA0271
Type:
Protein
Mol. Mass.:
20742.61
Organism:
Homo sapiens (Human)
Description:
Residue:
193
  
Inhibitor
Name:
BDBM50013839
Synonyms:
CHEMBL2030270
Type:
Small organic molecule
Emp. Form.:
C16H13NO5S3
Mol. Mass.:
395.473
SMILES:
OC(=O)CSc1cc(NS(=O)(=O)c2cccs2)c2ccccc2c1O
: