Target
Induced myeloid leukemia cell differentiation protein Mcl-1
Ligand
BDBM50013877
Substrate
Meas. Tech.
ChEMBL_1349702 (CHEMBL3266886)
Ki
>27000±n/a nM
Citation
 Abulwerdi, FALiao, CMady, ASGavin, JShen, CCierpicki, TStuckey, JAShowalter, HDNikolovska-Coleska, Z 3-Substituted-N-(4-hydroxynaphthalen-1-yl)arylsulfonamides as a novel class of selective Mcl-1 inhibitors: structure-based design, synthesis, SAR, and biological evaluation. J Med Chem 57:4111-33 (2014)  
Target
Name:
Induced myeloid leukemia cell differentiation protein Mcl-1
Synonyms:
BCL2L3 Bcl-2-like protein 3 (Mcl-1) Bcl2-L-3 MCL1 Mcl-1 Myeloid cell leukemia sequence 1 (BCL2-related) | mcl1/EAT
Type:
Membrane; Single-pass membrane protein
Mol. Mass.:
37332.87
Organism:
Homo sapiens (Human)
Description:
Q07820
Residue:
350
  
Inhibitor
Name:
BDBM50013877
Synonyms:
CHEMBL3265308
Type:
Small organic molecule
Emp. Form.:
C20H20BrNO3S2
Mol. Mass.:
466.412
SMILES:
CCCCSc1cc(NS(=O)(=O)c2ccc(Br)cc2)c2ccccc2c1O
: