Target
Glucose-dependent insulinotropic receptor
Ligand
BDBM50013912
Substrate
Meas. Tech.
ChEMBL_1350257 (CHEMBL3267240)
EC50
1.000000±n/a nM
Citation
 Alper, PAzimioara, MCow, CMutnick, DNikulin, VMichellys, PYWang, ZReding, EPaliotti, MLi, JBao, DZoll, JKim, YZimmerman, MGroessel, TTuntland, TJoseph, SBMcNamara, PSeidel, HMEpple, R Discovery of structurally novel, potent and orally efficacious GPR119 agonists. Bioorg Med Chem Lett 24:2383-7 (2014)  
Target
Name:
Glucose-dependent insulinotropic receptor
Synonyms:
G-protein coupled receptor 119 (GPR119) GPR119 | Glucose-dependent insulinotropic receptor
Type:
Protein
Mol. Mass.:
36901.49
Organism:
Homo sapiens (Human)
Description:
Q8TDV5
Residue:
335
  
Inhibitor
Name:
BDBM50013912
Synonyms:
CHEMBL3260536
Type:
Small organic molecule
Emp. Form.:
C27H27F3N4O2
Mol. Mass.:
496.5241
SMILES:
COCCN(C)C(=O)C(C)(Cc1ccccc1)c1ccnc2c(cnn12)-c1ccc(cc1)C(F)(F)F
: