Target
Discoidin domain-containing receptor 2
Ligand
BDBM50362102
Substrate
Meas. Tech.
ChEMBL_1350711 (CHEMBL3265735)
IC50
2230±n/a nM
Citation
 Richters, ANguyen, HDPhan, TSimard, JRGrütter, CEngel, JRauh, D Identification of type II and III DDR2 inhibitors. J Med Chem 57:4252-62 (2014)  
Target
Name:
Discoidin domain-containing receptor 2
Synonyms:
DDR2 Discoidin domain receptor 2 (DDR2) Discoidin domain-containing receptor 2 (DDR2) NTRKR3 TYRO10
Type:
Protein
Mol. Mass.:
96717.07
Organism:
Homo sapiens (Human)
Description:
Q16832
Residue:
855
  
Inhibitor
Name:
BDBM50362102
Synonyms:
CHEMBL1738945
Type:
Small organic molecule
Emp. Form.:
C28H31N5O4S
Mol. Mass.:
533.642
SMILES:
CC(C)(C)c1cc(NC(=O)Nc2nc(CCOCc3ccccc3)cs2)n(n1)-c1ccc(CC(O)=O)cc1
: