Target
Glucose-dependent insulinotropic receptor
Ligand
BDBM50014372
Substrate
Meas. Tech.
ChEMBL_1350718 (CHEMBL3266103)
EC50
1003±n/a nM
Citation
 Ye, XYMorales, CLWang, YRossi, KAMalmstrom, SEAbousleiman, MSereda, LApedo, ARobl, JAMiller, KJKrupinski, JWacker, DA Synthesis and structure-activity relationship of dihydrobenzofuran derivatives as novel human GPR119 agonists. Bioorg Med Chem Lett 24:2539-45 (2014)  
Target
Name:
Glucose-dependent insulinotropic receptor
Synonyms:
G-protein coupled receptor 119 (GPR119) GPR119 | Glucose-dependent insulinotropic receptor
Type:
Protein
Mol. Mass.:
36901.49
Organism:
Homo sapiens (Human)
Description:
Q8TDV5
Residue:
335
  
Inhibitor
Name:
BDBM50014372
Synonyms:
CHEMBL3261124
Type:
Small organic molecule
Emp. Form.:
C24H36N2O5S2
Mol. Mass.:
496.683
SMILES:
CCCS(=O)(=O)N1CCC(CC1)C1Cc2cc(ccc2O1)C1=CCN(CC1)S(=O)(=O)CCC
: