Target
Cytochrome P450 2D6
Ligand
BDBM50014432
Substrate
Meas. Tech.
ChEMBL_1350935 (CHEMBL3268090)
IC50
>20000±n/a nM
Citation
 Edman, KAhlgren, RBengtsson, MBladh, HBäckström, SDahmén, JHenriksson, KHillertz, PHulikal, VJerre, AKinchin, LKåse, CLepistö, MMile, INilsson, SSmailagic, ATaylor, JTjörnebo, AWissler, LHansson, T The discovery of potent and selective non-steroidal glucocorticoid receptor modulators, suitable for inhalation. Bioorg Med Chem Lett 24:2571-7 (2014)  
Target
Name:
Cytochrome P450 2D6
Synonyms:
CP2D6_HUMAN CYP2DL1 Cytochrome P450 2D6 (CYP2D6) P450-DB1
Type:
Protein
Mol. Mass.:
55774.82
Organism:
Homo sapiens (Human)
Description:
P10635
Residue:
497
  
Inhibitor
Name:
BDBM50014432
Synonyms:
CHEMBL3261407
Type:
Small organic molecule
Emp. Form.:
C25H27FN4O2S
Mol. Mass.:
466.571
SMILES:
C[C@@H](CNc1cccc2n(ncc12)-c1ccc(F)cc1)NS(=O)(=O)c1c(C)cc(C)cc1C
: