Target
Glucocorticoid receptor
Ligand
BDBM50014447
Substrate
Meas. Tech.
ChEMBL_1350746 (CHEMBL3266131)
IC50
5.7±n/a nM
Citation
 Edman, KAhlgren, RBengtsson, MBladh, HBäckström, SDahmén, JHenriksson, KHillertz, PHulikal, VJerre, AKinchin, LKåse, CLepistö, MMile, INilsson, SSmailagic, ATaylor, JTjörnebo, AWissler, LHansson, T The discovery of potent and selective non-steroidal glucocorticoid receptor modulators, suitable for inhalation. Bioorg Med Chem Lett 24:2571-7 (2014)  
Target
Name:
Glucocorticoid receptor
Synonyms:
GCR_HUMAN GRL Glucocorticoid receptor (GRFP) Nuclear receptor subfamily 3 group C member 1
Type:
Enzyme
Mol. Mass.:
85656.87
Organism:
Homo sapiens (Human)
Description:
P04150
Residue:
777
  
Inhibitor
Name:
BDBM50014447
Synonyms:
CHEMBL3261428
Type:
Small organic molecule
Emp. Form.:
C24H30N8O2S
Mol. Mass.:
494.612
SMILES:
C[C@@H](CNc1cccc2n(ncc12)-c1cncnc1)NS(=O)(=O)c1c(C)nn(C2CCCC2)c1C
: